Target
Bifunctional epoxide hydrolase 2
Ligand
BDBM41898
Substrate
Meas. Tech.
sEH_DR_Inh_Infinite200_Fluorescence_01072008
IC50
8.9±n/a nM
Citation
 PubChem, PC sEH_DR_Inh_Infinite200_Fluorescence_01072008 PubChem Bioassay (2008)[AID] 
Target
Name:
Bifunctional epoxide hydrolase 2
Synonyms:
Cytosolic epoxide hydrolase 2 EPHX2 HYES_HUMAN Soluble epoxide hydrolase (sEH) | epoxide hydrolase 2, cytoplasmic
Type:
Enzyme
Mol. Mass.:
62613.07
Organism:
Homo sapiens (Human)
Description:
P34913
Residue:
555
  
Inhibitor
Name:
BDBM41898
Synonyms:
4-[3-(3-Cyclohexyl-ureido)-8-aza-bicyclo[3.2.1]octane-8-sulfonyl]-benzoic acid methyl ester 4-[[3-[[(cyclohexylamino)-oxomethyl]amino]-8-azabicyclo[3.2.1]octan-8-yl]sulfonyl]benzoic acid methyl ester SMR000006687 methyl 4-[[3-(cyclohexylcarbamoylamino)-8-azabicyclo[3.2.1]octan-8-yl]sulfonyl]benzoate
Type:
Small organic molecule
Emp. Form.:
C22H31N3O5S
Mol. Mass.:
449.564
SMILES:
[H]C12CCC([H])(CC(C1)NC(=O)NC1CCCCC1)N2S(=O)(=O)c1ccc(cc1)C(=O)OC
: