Target
Bifunctional epoxide hydrolase 2
Ligand
BDBM41937
Substrate
Meas. Tech.
sEH_DR_Inh_Infinite200_Fluorescence_01072008
IC50
82.5±n/a nM
Citation
 PubChem, PC sEH_DR_Inh_Infinite200_Fluorescence_01072008 PubChem Bioassay (2008)[AID] 
Target
Name:
Bifunctional epoxide hydrolase 2
Synonyms:
Cytosolic epoxide hydrolase 2 EPHX2 HYES_HUMAN Soluble epoxide hydrolase (sEH) | epoxide hydrolase 2, cytoplasmic
Type:
Enzyme
Mol. Mass.:
62613.07
Organism:
Homo sapiens (Human)
Description:
P34913
Residue:
555
  
Inhibitor
Name:
BDBM41937
Synonyms:
4-methylbenzenesulfonic acid [2-methoxy-5-[[(3-nitrobenzoyl)hydrazono]methyl]phenyl] ester 5-(2-{3-nitrobenzoyl}carbohydrazonoyl)-2-methoxyphenyl 4-methylbenzenesulfonate SMR000163809 [2-methoxy-5-[[(3-nitrophenyl)carbonylhydrazinylidene]methyl]phenyl] 4-methylbenzenesulfonate | cid_1738435
Type:
Small organic molecule
Emp. Form.:
C22H19N3O7S
Mol. Mass.:
469.467
SMILES:
COc1ccc([CH+][N-]NC(=O)c2cccc(c2)[N+]([O-])=O)cc1OS(=O)(=O)c1ccc(C)cc1
: