Target
Bifunctional epoxide hydrolase 2
Ligand
BDBM41943
Substrate
Meas. Tech.
sEH_DR_Inh_Infinite200_Fluorescence_01072008
IC50
30.3±n/a nM
Citation
 PubChem, PC sEH_DR_Inh_Infinite200_Fluorescence_01072008 PubChem Bioassay (2008)[AID] 
Target
Name:
Bifunctional epoxide hydrolase 2
Synonyms:
Cytosolic epoxide hydrolase 2 EPHX2 HYES_HUMAN Soluble epoxide hydrolase (sEH) | epoxide hydrolase 2, cytoplasmic
Type:
Enzyme
Mol. Mass.:
62613.07
Organism:
Homo sapiens (Human)
Description:
P34913
Residue:
555
  
Inhibitor
Name:
BDBM41943
Synonyms:
MLS000582818 N-[2-(cyclohexylthio)ethyl]-4-methyl-3-(o-tolylsulfamoyl)benzamide N-[2-(cyclohexylthio)ethyl]-4-methyl-3-{[(2-methylphenyl)amino]sulfonyl}benzamide cid_2237347
Type:
Small organic molecule
Emp. Form.:
C23H30N2O3S2
Mol. Mass.:
446.626
SMILES:
Cc1ccccc1NS(=O)(=O)c1cc(ccc1C)C(=O)NCCSC1CCCCC1
: