Target
Dual specificity protein phosphatase 6
Ligand
BDBM31727
Substrate
Meas. Tech.
MKP-3 in vitro secondary assay for identification of irreversible and slow-binding inhibitors
IC50
41300±1500 nM
Citation
 PubChem, PC MKP-3 in vitro secondary assay for identification of irreversible and slow-binding inhibitors PubChem Bioassay (2008)[AID] 
Target
Name:
Dual specificity protein phosphatase 6
Synonyms:
DUS6_RAT MAP kinase phosphatase 3 Mitogen-activated protein kinase phosphatase 3 | Mkp3
Type:
Enzyme
Mol. Mass.:
42303.19
Organism:
Rattus norvegicus
Description:
gi_16758752
Residue:
381
  
Inhibitor
Name:
BDBM31727
Synonyms:
7,9-dimethyl-3a,4,5,9b-tetrahydro-3H-cyclopenta[c]quinoline-4-carboxylic acid cid_3125599
Type:
Small organic molecule
Emp. Form.:
C15H17NO2
Mol. Mass.:
243.301
SMILES:
Cc1cc(C)c2C3C=CCC3C(Nc2c1)C(O)=O
: