Target
Dual specificity protein phosphatase 6
Ligand
BDBM31759
Substrate
Meas. Tech.
MKP-3 in vitro secondary assay for identification of irreversible and slow-binding inhibitors
IC50
6800±300 nM
Citation
 PubChem, PC MKP-3 in vitro secondary assay for identification of irreversible and slow-binding inhibitors PubChem Bioassay (2008)[AID] 
Target
Name:
Dual specificity protein phosphatase 6
Synonyms:
DUS6_RAT MAP kinase phosphatase 3 Mitogen-activated protein kinase phosphatase 3 | Mkp3
Type:
Enzyme
Mol. Mass.:
42303.19
Organism:
Rattus norvegicus
Description:
gi_16758752
Residue:
381
  
Inhibitor
Name:
BDBM31759
Synonyms:
2-[5-[(Z)-(3-bromanyl-8-oxidanylidene-[1,3]thiazolo[4,5]imidazo[1,2-b]pyridin-7-ylidene)methyl]furan-2-yl]benzoic acid 2-[5-[(Z)-(3-bromo-8-oxo-7-thiazolo[4,5]imidazo[1,2-b]pyridinylidene)methyl]-2-furanyl]benzoic acid MLS-0090801.0001 | cid_1357397
Type:
Small organic molecule
Emp. Form.:
C20H10BrN3O4S
Mol. Mass.:
468.28
SMILES:
OC(=O)c1ccccc1-c1ccc(\C=c2/sc3nc4cc(Br)cnc4n3c2=O)o1
: