Target
Bcl-2-related protein A1
Ligand
BDBM39120
Substrate
Meas. Tech.
In Vitro Bfl-1 Dose Response Fluorescence Polarization Assay for SAR Study
IC50
1510±1730 nM
Citation
 PubChem, PC In Vitro Bfl-1 Dose Response Fluorescence Polarization Assay for SAR Study PubChem Bioassay (2008)[AID] 
Target
Name:
Bcl-2-related protein A1
Synonyms:
A1 B-cell leukemia/lymphoma 2 related protein A1a Bcl2a1 Bfl-1 Hemopoietic-specific early response protein | Protein BFL-1
Type:
Apoptosis regulator protein
Mol. Mass.:
19909.74
Organism:
Mus musculus (Mouse)
Description:
gi_11024684
Residue:
172
  
Inhibitor
Name:
BDBM39120
Synonyms:
3-chloranyl-1-(3,4-dichlorophenyl)-4-morpholin-4-yl-pyrrole-2,5-dione 3-chloro-1-(3,4-dichlorophenyl)-4-morpholin-4-ylpyrrole-2,5-dione MLS-0067124.0001 | cid_1074953
Type:
Small organic molecule
Emp. Form.:
C14H11Cl3N2O3
Mol. Mass.:
361.608
SMILES:
ClC1=C(N2CCOCC2)C(=O)N(C1=O)c1ccc(Cl)c(Cl)c1
: