Target
Bcl-2-related protein A1
Ligand
BDBM39132
Substrate
Meas. Tech.
In Vitro Bfl-1 Dose Response Fluorescence Polarization Assay for SAR Study
IC50
1640±170 nM
Citation
 PubChem, PC In Vitro Bfl-1 Dose Response Fluorescence Polarization Assay for SAR Study PubChem Bioassay (2008)[AID] 
Target
Name:
Bcl-2-related protein A1
Synonyms:
A1 B-cell leukemia/lymphoma 2 related protein A1a Bcl2a1 Bfl-1 Hemopoietic-specific early response protein | Protein BFL-1
Type:
Apoptosis regulator protein
Mol. Mass.:
19909.74
Organism:
Mus musculus (Mouse)
Description:
gi_11024684
Residue:
172
  
Inhibitor
Name:
BDBM39132
Synonyms:
3,4-bis(chloranyl)-1-(2,4-dichlorophenyl)pyrrole-2,5-dione 3,4-dichloro-1-(2,4-dichlorophenyl)pyrrole-2,5-dione cid_716793
Type:
Small organic molecule
Emp. Form.:
C10H3Cl4NO2
Mol. Mass.:
310.948
SMILES:
ClC1=C(Cl)C(=O)N(C1=O)c1ccc(Cl)cc1Cl
: