Target
Bcl-2-related protein A1
Ligand
BDBM39168
Substrate
Meas. Tech.
In Vitro Bfl-1 Dose Response Fluorescence Polarization Assay for SAR Study
IC50
4460±1190 nM
Citation
 PubChem, PC In Vitro Bfl-1 Dose Response Fluorescence Polarization Assay for SAR Study PubChem Bioassay (2008)[AID] 
Target
Name:
Bcl-2-related protein A1
Synonyms:
A1 B-cell leukemia/lymphoma 2 related protein A1a Bcl2a1 Bfl-1 Hemopoietic-specific early response protein | Protein BFL-1
Type:
Apoptosis regulator protein
Mol. Mass.:
19909.74
Organism:
Mus musculus (Mouse)
Description:
gi_11024684
Residue:
172
  
Inhibitor
Name:
BDBM39168
Synonyms:
3-chloranyl-4-[4-[2-(2-hydroxyethyloxy)ethyl]piperazin-1-yl]-1-(3-methylphenyl)pyrrole-2,5-dione 3-chloro-4-[4-[2-(2-hydroxyethoxy)ethyl]piperazin-1-yl]-1-(3-methylphenyl)pyrrole-2,5-dione MLS-0111701.0001 | cid_16654731
Type:
Small organic molecule
Emp. Form.:
C19H24ClN3O4
Mol. Mass.:
393.865
SMILES:
Cc1cccc(c1)N1C(=O)C(Cl)=C(N2CCN(CCOCCO)CC2)C1=O
: