Target
Bcl-2-related protein A1
Ligand
BDBM39171
Substrate
Meas. Tech.
In Vitro Bfl-1 Dose Response Fluorescence Polarization Assay for SAR Study
IC50
1490±230 nM
Citation
 PubChem, PC In Vitro Bfl-1 Dose Response Fluorescence Polarization Assay for SAR Study PubChem Bioassay (2008)[AID] 
Target
Name:
Bcl-2-related protein A1
Synonyms:
A1 B-cell leukemia/lymphoma 2 related protein A1a Bcl2a1 Bfl-1 Hemopoietic-specific early response protein | Protein BFL-1
Type:
Apoptosis regulator protein
Mol. Mass.:
19909.74
Organism:
Mus musculus (Mouse)
Description:
gi_11024684
Residue:
172
  
Inhibitor
Name:
BDBM39171
Synonyms:
3-chloranyl-4-morpholin-4-yl-1-(4-nitrophenyl)pyrrole-2,5-dione 3-chloro-4-morpholin-4-yl-1-(4-nitrophenyl)pyrrole-2,5-dione MLS-0111723.0001 | cid_16654752
Type:
Small organic molecule
Emp. Form.:
C14H12ClN3O5
Mol. Mass.:
337.715
SMILES:
[O-][N+](=O)c1ccc(cc1)N1C(=O)C(Cl)=C(N2CCOCC2)C1=O
: