Target
Estrogen receptor
Ligand
BDBM40537
Substrate
Meas. Tech.
Estrogen Receptor (alpha) binding: Dose Response of Primary Screen Assay
EC50
>10000±n/a nM
Citation
 PubChem, PC Estrogen Receptor (alpha) binding: Dose Response of Primary Screen Assay PubChem Bioassay (2008)[AID] 
Target
Name:
Estrogen receptor
Synonyms:
ER ESR ESR1_HUMAN Estrogen receptor Estrogen receptor (ER-alpha) Estrogen receptor alpha (ER) Nuclear receptor subfamily 3 group A member 1
Type:
Protein
Mol. Mass.:
66230.44
Organism:
Homo sapiens (Human)
Description:
P03372
Residue:
595
  
Inhibitor
Name:
BDBM40537
Synonyms:
4-(2,5-dioxo-1-pyrrolidinyl)-N-(3-ethyl-4,7-dimethoxy-1,3-benzothiazol-2-ylidene)benzamide 4-[2,5-bis(oxidanylidene)pyrrolidin-1-yl]-N-(3-ethyl-4,7-dimethoxy-1,3-benzothiazol-2-ylidene)benzamide N-(3-ethyl-4,7-dimethoxy-1,3-benzothiazol-2-ylidene)-4-succinimido-benzamide cid_2150886
Type:
Small organic molecule
Emp. Form.:
C22H21N3O5S
Mol. Mass.:
439.484
SMILES:
CCn1c2c(OC)ccc(OC)c2sc1=NC(=O)c1ccc(cc1)-n1c(O)ccc1O
: