Target
Estrogen receptor
Ligand
BDBM42029
Substrate
Meas. Tech.
Estrogen Receptor (alpha) binding: Dose Response of Primary Screen Assay
EC50
4.76±n/a nM
Citation
 PubChem, PC Estrogen Receptor (alpha) binding: Dose Response of Primary Screen Assay PubChem Bioassay (2008)[AID] 
Target
Name:
Estrogen receptor
Synonyms:
ER ESR ESR1_HUMAN Estrogen receptor Estrogen receptor (ER-alpha) Estrogen receptor alpha (ER) Nuclear receptor subfamily 3 group A member 1
Type:
Protein
Mol. Mass.:
66230.44
Organism:
Homo sapiens (Human)
Description:
P03372
Residue:
595
  
Inhibitor
Name:
BDBM42029
Synonyms:
4-(1-cyclohex-3-enyl)-6-methoxy-8-nitro-3a,4,5,9b-tetrahydro-3H-cyclopenta[c]quinoline UNM000011059201 | cid_2868331
Type:
Small organic molecule
Emp. Form.:
C19H22N2O3
Mol. Mass.:
326.3896
SMILES:
COc1cc(cc2C3C=CCC3C(Nc12)C1CCC=CC1)[N+]([O-])=O
: