Target
Galanin receptor type 2
Ligand
BDBM42069
Substrate
Meas. Tech.
Dose Response cell-based high-throughput screening assay to identify antagonists of galanin receptor 2 (GALR2)
IC50
10320±n/a nM
Citation
 PubChem, PC Dose Response cell-based high-throughput screening assay to identify antagonists of galanin receptor 2 (GALR2) PubChem Bioassay (2008)[AID] 
Target
Name:
Galanin receptor type 2
Synonyms:
GALNR2 GALR2_HUMAN Galanin receptor 2 Galanin receptor type 2 (GAL2-R) (GALR2).
Type:
Enzyme Catalytic Domain
Mol. Mass.:
41724.40
Organism:
Homo sapiens (Human)
Description:
Galanin R2 GALR2 HUMAN::O43603
Residue:
387
  
Inhibitor
Name:
BDBM42069
Synonyms:
2-acetamido-4,5-dinitro-benzoic acid ethyl ester MLS000698400 cid_4104905 ethyl 2-acetamido-4,5-dinitro-benzoate | ethyl 2-acetamido-4,5-dinitrobenzoate
Type:
Small organic molecule
Emp. Form.:
C11H11N3O7
Mol. Mass.:
297.2209
SMILES:
CCOC(=O)c1cc(c(cc1NC(C)=O)[N+]([O-])=O)[N+]([O-])=O
: