Target
Glyceraldehyde-3-phosphate dehydrogenase
Ligand
BDBM31735
Substrate
Meas. Tech.
GAPDH Dose Response Colorimetric Assay
IC50
27800±2020 nM
Citation
 PubChem, PC GAPDH Dose Response Colorimetric Assay PubChem Bioassay (2008)[AID] 
Target
Name:
Glyceraldehyde-3-phosphate dehydrogenase
Synonyms:
G3P_HUMAN GAPDH glyceraldehyde-3-phosphate dehydrogenase
Type:
PROTEIN
Mol. Mass.:
36060.86
Organism:
Homo sapiens (Human)
Description:
ChEMBL_1511315
Residue:
335
  
Inhibitor
Name:
BDBM31735
Synonyms:
(7Z)-3-bromanyl-7-(furan-2-ylmethylidene)-[1,3]thiazolo[4,5]imidazo[1,2-b]pyridin-8-one (7Z)-3-bromo-7-(2-furfurylidene)thiazolo[4,5]imidazo[1,2-b]pyridin-8-one MLS-0091940.0001 | cid_6456506
Type:
Small organic molecule
Emp. Form.:
C13H6BrN3O2S
Mol. Mass.:
348.175
SMILES:
Brc1cnc2c(c1)nc1s\c(=C/c3ccco3)c(=O)n21
: