Target
Glyceraldehyde-3-phosphate dehydrogenase
Ligand
BDBM41956
Substrate
Meas. Tech.
GAPDH Dose Response Colorimetric Assay
IC50
62700±7390 nM
Citation
 PubChem, PC GAPDH Dose Response Colorimetric Assay PubChem Bioassay (2008)[AID] 
Target
Name:
Glyceraldehyde-3-phosphate dehydrogenase
Synonyms:
G3P_HUMAN GAPDH glyceraldehyde-3-phosphate dehydrogenase
Type:
PROTEIN
Mol. Mass.:
36060.86
Organism:
Homo sapiens (Human)
Description:
ChEMBL_1511315
Residue:
335
  
Inhibitor
Name:
BDBM41956
Synonyms:
7,9-bis(chloranyl)-3a,4,5,9b-tetrahydro-3H-cyclopenta[c]quinoline-4-carboxylic acid MLS-0091953.0001 | cid_2914772
Type:
Small organic molecule
Emp. Form.:
C13H11Cl2NO2
Mol. Mass.:
284.138
SMILES:
OC(=O)C1Nc2cc(Cl)cc(Cl)c2C2C=CCC12
: