Target
Glyceraldehyde-3-phosphate dehydrogenase
Ligand
BDBM31757
Substrate
Meas. Tech.
GAPDH Dose Response Colorimetric Assay
IC50
47700±4640 nM
Citation
 PubChem, PC GAPDH Dose Response Colorimetric Assay PubChem Bioassay (2008)[AID] 
Target
Name:
Glyceraldehyde-3-phosphate dehydrogenase
Synonyms:
G3P_HUMAN GAPDH glyceraldehyde-3-phosphate dehydrogenase
Type:
PROTEIN
Mol. Mass.:
36060.86
Organism:
Homo sapiens (Human)
Description:
ChEMBL_1511315
Residue:
335
  
Inhibitor
Name:
BDBM31757
Synonyms:
6-hydroxy-3a,4,5,9b-tetrahydro-3H-cyclopenta[c]quinoline-4-carboxylic acid MLS-0015717.0001 | cid_654089
Type:
Small organic molecule
Emp. Form.:
C13H13NO3
Mol. Mass.:
231.2472
SMILES:
OC(=O)C1Nc2c(O)cccc2C2C=CCC12
: