Target
Nuclear receptor subfamily 4 group A member 1
Ligand
BDBM42109
Substrate
Meas. Tech.
Fluorescence Polarization Dose Response Assay for TR3-Based Bcl-B Inhibitors
EC50
4130±4050 nM
Citation
 PubChem, PC Fluorescence Polarization Dose Response Assay for TR3-Based Bcl-B Inhibitors PubChem Bioassay (2008)[AID] 
Target
Name:
Nuclear receptor subfamily 4 group A member 1
Synonyms:
GFRP1 NAK1 NR4A1_HUMAN | nuclear receptor subfamily 4, group A, member 1
Type:
Enzyme Catalytic Domain
Mol. Mass.:
64467.13
Organism:
Homo sapiens (Human)
Description:
gi_27894344
Residue:
598
  
Inhibitor
Name:
BDBM42109
Synonyms:
BIM-0034959.P001 | cid_5343929
Type:
Small organic molecule
Emp. Form.:
C25H23NO3
Mol. Mass.:
385.455
SMILES:
OC(=O)C1C2CC=CC2c2cc(Oc3ccccc3)cc3C4C=CCC4CN1c23
: