Target
Nuclear receptor subfamily 4 group A member 1
Ligand
BDBM42118
Substrate
Meas. Tech.
Fluorescence Polarization Dose Response Assay for TR3-Based Bcl-B Inhibitors
EC50
5360±2030 nM
Citation
 PubChem, PC Fluorescence Polarization Dose Response Assay for TR3-Based Bcl-B Inhibitors PubChem Bioassay (2008)[AID] 
Target
Name:
Nuclear receptor subfamily 4 group A member 1
Synonyms:
GFRP1 NAK1 NR4A1_HUMAN | nuclear receptor subfamily 4, group A, member 1
Type:
Enzyme Catalytic Domain
Mol. Mass.:
64467.13
Organism:
Homo sapiens (Human)
Description:
gi_27894344
Residue:
598
  
Inhibitor
Name:
BDBM42118
Synonyms:
(5Z)-1-allyl-5-[[1-(3-nitrophenyl)pyrrol-2-yl]methylene]-2-thioxo-hexahydropyrimidine-4,6-quinone (5Z)-5-[[1-(3-nitrophenyl)pyrrol-2-yl]methylidene]-1-prop-2-enyl-2-sulfanylidene-1,3-diazinane-4,6-dione cid_5345833
Type:
Small organic molecule
Emp. Form.:
C18H14N4O4S
Mol. Mass.:
382.393
SMILES:
[O-][N+](=O)c1cccc(c1)[N+]1=CC=CC1=C[c-]1c(=O)[nH]c(=S)n(CC=C)c1=O
: