Target
Nuclear receptor subfamily 4 group A member 1
Ligand
BDBM42119
Substrate
Meas. Tech.
Fluorescence Polarization Dose Response Assay for TR3-Based Bcl-B Inhibitors
EC50
8750±2810 nM
Citation
 PubChem, PC Fluorescence Polarization Dose Response Assay for TR3-Based Bcl-B Inhibitors PubChem Bioassay (2008)[AID] 
Target
Name:
Nuclear receptor subfamily 4 group A member 1
Synonyms:
GFRP1 NAK1 NR4A1_HUMAN | nuclear receptor subfamily 4, group A, member 1
Type:
Enzyme Catalytic Domain
Mol. Mass.:
64467.13
Organism:
Homo sapiens (Human)
Description:
gi_27894344
Residue:
598
  
Inhibitor
Name:
BDBM42119
Synonyms:
2-[4-(2,5-dimethyl-1-pyrrolyl)phenoxy]acetic acid 2-[4-(2,5-dimethylpyrrol-1-yl)phenoxy]ethanoic acid cid_776871
Type:
Small organic molecule
Emp. Form.:
C14H15NO3
Mol. Mass.:
245.2738
SMILES:
Cc1ccc(C)n1-c1ccc(OCC(O)=O)cc1
: