Target
Cytochrome P450 11B2, mitochondrial
Ligand
BDBM101382
Substrate
Meas. Tech.
Cellular Enzyme Assay
Temperature
310.15±n/a K
EC50
0.40±n/a nM
Comments
extracted
Citation
 Aebi, JAmrein, KChen, WHornsperger, BKuhn, BLiu, YMaerki, HPMartin, REMayweg, ATan, XWang, LZhou, M 3,4-dihydro-2H-isoquinoline-1-one and 2,3-dihydro-isoindol-1-one compounds US Patent  US9695152 Publication Date 7/4/2017 
Target
Name:
Cytochrome P450 11B2, mitochondrial
Synonyms:
Aldosterone Synthase (CYP11B2) Aldosterone-synthesizing enzyme CYP11B2 Cytochrome P450 11B2 Cytochrome P450 11B2, mitochondrial P-450C18 | Steroid 18-hydroxylase
Type:
Protein
Mol. Mass.:
57582.15
Organism:
Homo sapiens (Human)
Description:
P19099
Residue:
503
  
Inhibitor
Name:
BDBM101382
Synonyms:
US9695152, 3
Type:
Small organic molecule
Emp. Form.:
C22H25ClN4O3S
Mol. Mass.:
460.977
SMILES:
CN(C1CN(C1)S(=O)(=O)C1CC1)c1cncc(c1)N1C(=O)c2ccc(Cl)cc2C1(C)C
: