Target
Cytochrome P450 11B2, mitochondrial
Ligand
BDBM101388
Substrate
Meas. Tech.
Cellular Enzyme Assay
Temperature
310.15±n/a K
EC50
7.00±n/a nM
Comments
extracted
Citation
 Aebi, JAmrein, KChen, WHornsperger, BKuhn, BLiu, YMaerki, HPMartin, REMayweg, ATan, XWang, LZhou, M 3,4-dihydro-2H-isoquinoline-1-one and 2,3-dihydro-isoindol-1-one compounds US Patent  US9695152 Publication Date 7/4/2017 
Target
Name:
Cytochrome P450 11B2, mitochondrial
Synonyms:
Aldosterone Synthase (CYP11B2) Aldosterone-synthesizing enzyme CYP11B2 Cytochrome P450 11B2 Cytochrome P450 11B2, mitochondrial P-450C18 | Steroid 18-hydroxylase
Type:
Protein
Mol. Mass.:
57582.15
Organism:
Homo sapiens (Human)
Description:
P19099
Residue:
503
  
Inhibitor
Name:
BDBM101388
Synonyms:
US9695152, 9
Type:
Small organic molecule
Emp. Form.:
C24H21Cl2N5O2
Mol. Mass.:
482.362
SMILES:
CC1(C)N(C(=O)c2ccc(Cl)cc12)c1cncc(NC2CN(C2)C(=O)c2ncccc2Cl)c1
: