Target
Cytochrome P450 11B1, mitochondrial
Ligand
BDBM101401
Substrate
Meas. Tech.
Cellular Enzyme Assay
Temperature
310.15±n/a K
EC50
2088±n/a nM
Comments
extracted
Citation
 Aebi, JAmrein, KChen, WHornsperger, BKuhn, BLiu, YMaerki, HPMartin, REMayweg, ATan, XWang, LZhou, M 3,4-dihydro-2H-isoquinoline-1-one and 2,3-dihydro-isoindol-1-one compounds US Patent  US9695152 Publication Date 7/4/2017 
Target
Name:
Cytochrome P450 11B1, mitochondrial
Synonyms:
C11B1_HUMAN CYPXIB1 Cytochrome P450 11B1 Cytochrome P450 11B1, mitochondrial | S11BH
Type:
Enzyme
Mol. Mass.:
57591.44
Organism:
Homo sapiens (Human)
Description:
P15538
Residue:
503
  
Inhibitor
Name:
BDBM101401
Synonyms:
US9695152, 22
Type:
Small organic molecule
Emp. Form.:
C22H21ClN6O2
Mol. Mass.:
436.894
SMILES:
Cn1ccnc1C(=O)N1CC(C1)Nc1cncc(c1)N1CCc2cc(Cl)ccc2C1=O
: