Target
Cytochrome P450 11B2, mitochondrial
Ligand
BDBM101411
Substrate
Meas. Tech.
Cellular Enzyme Assay
Temperature
310.15±n/a K
EC50
27±n/a nM
Comments
extracted
Citation
 Aebi, JAmrein, KChen, WHornsperger, BKuhn, BLiu, YMaerki, HPMartin, REMayweg, ATan, XWang, LZhou, M 3,4-dihydro-2H-isoquinoline-1-one and 2,3-dihydro-isoindol-1-one compounds US Patent  US9695152 Publication Date 7/4/2017 
Target
Name:
Cytochrome P450 11B2, mitochondrial
Synonyms:
Aldosterone Synthase (CYP11B2) Aldosterone-synthesizing enzyme CYP11B2 Cytochrome P450 11B2 Cytochrome P450 11B2, mitochondrial P-450C18 | Steroid 18-hydroxylase
Type:
Protein
Mol. Mass.:
57582.15
Organism:
Homo sapiens (Human)
Description:
P19099
Residue:
503
  
Inhibitor
Name:
BDBM101411
Synonyms:
US9695152, 32
Type:
Small organic molecule
Emp. Form.:
C26H24N6O2
Mol. Mass.:
452.5078
SMILES:
Cc1ccncc1C(=O)N1CC(C1)Nc1cncc(c1)N1C(=O)c2ccc(cc2C1(C)C)C#N
: