Target
Tyrosine-protein phosphatase YopH
Ligand
BDBM42257
Substrate
Meas. Tech.
YopH - IC50 determinations (10 point dose range)
IC50
37268.0397±n/a nM
Citation
 PubChem, PC YopH - IC50 determinations (10 point dose range) PubChem Bioassay (2008)[AID] 
Target
Name:
Tyrosine-protein phosphatase YopH
Synonyms:
YOPH_YEREN yopH
Type:
PROTEIN
Mol. Mass.:
50951.99
Organism:
Yersinia enterocolitica
Description:
ChEMBL_965525
Residue:
468
  
Inhibitor
Name:
BDBM42257
Synonyms:
3,4,5-trihydroxybenzoic acid [(3R,4S,5S,6S)-3,4,5,6-tetragalloyloxytetrahydropyran-2-yl]methyl ester MLS000574902 [(3R,4S,5S,6S)-3,4,5,6-tetrakis[(3,4,5-trihydroxybenzoyl)oxy]oxan-2-yl]methyl 3,4,5-trihydroxybenzoate cid_15945060
Type:
Small organic molecule
Emp. Form.:
C41H32O26
Mol. Mass.:
940.6772
SMILES:
Oc1cc(cc(O)c1O)C(=O)OCC1O[C@@H](OC(=O)c2cc(O)c(O)c(O)c2)[C@@H](OC(=O)c2cc(O)c(O)c(O)c2)[C@@H](OC(=O)c2cc(O)c(O)c(O)c2)[C@@H]1OC(=O)c1cc(O)c(O)c(O)c1
: