Target
Lysosomal acid glucosylceramidase
Ligand
BDBM42299
Substrate
Meas. Tech.
Dose response cell-based high throughput screening assay to identify enhancers of beta-glucosidase activity
EC50
>50000±n/a nM
Citation
 PubChem, PC Dose response cell-based high throughput screening assay to identify enhancers of beta-glucosidase activity PubChem Bioassay (2008)[AID] 
Target
Name:
Lysosomal acid glucosylceramidase
Synonyms:
Acid beta-glucosidase Beta-glucocerebrosidase D-glucosyl-N-acylsphingosine glucohydrolase GBA1 GC GLUC Glucosylceramidase (GBA) Glucosylceramidase precursor (Beta-glucocerebrosidase) (Acid beta-glucosidase) (D-glucosyl-N-acylsphingosine glucohydrolase) (Alglucerase) (Imiglucerase) beta-glucocerebrosidase (GCase)
Type:
Enzyme
Mol. Mass.:
59724.64
Organism:
Homo sapiens (Human)
Description:
The beta-Glu activity was measured with commercially available beta-glucocerebrosidase (Ceredase) as the enzyme source.
Residue:
536
  
Inhibitor
Name:
BDBM42299
Synonyms:
(5Z)-4-allyl-5-indol-3-ylidene-1,2,4-triazolidine-3-thione (5Z)-5-indol-3-ylidene-4-prop-2-enyl-1,2,4-triazolidine-3-thione SMR000034158 | cid_5389222
Type:
Small organic molecule
Emp. Form.:
C13H12N4S
Mol. Mass.:
256.326
SMILES:
C=CCn1c(n[nH]c1=S)-c1c[nH]c2ccccc12
: