Target
Lysosomal acid glucosylceramidase
Ligand
BDBM42302
Substrate
Meas. Tech.
Dose response cell-based high throughput screening assay to identify enhancers of beta-glucosidase activity
EC50
>50000±n/a nM
Citation
 PubChem, PC Dose response cell-based high throughput screening assay to identify enhancers of beta-glucosidase activity PubChem Bioassay (2008)[AID] 
Target
Name:
Lysosomal acid glucosylceramidase
Synonyms:
Acid beta-glucosidase Beta-glucocerebrosidase D-glucosyl-N-acylsphingosine glucohydrolase GBA1 GC GLUC Glucosylceramidase (GBA) Glucosylceramidase precursor (Beta-glucocerebrosidase) (Acid beta-glucosidase) (D-glucosyl-N-acylsphingosine glucohydrolase) (Alglucerase) (Imiglucerase) beta-glucocerebrosidase (GCase)
Type:
Enzyme
Mol. Mass.:
59724.64
Organism:
Homo sapiens (Human)
Description:
The beta-Glu activity was measured with commercially available beta-glucocerebrosidase (Ceredase) as the enzyme source.
Residue:
536
  
Inhibitor
Name:
BDBM42302
Synonyms:
MLS000041013 N-(2,3-dihydro-1,4-benzodioxin-6-yl)-2-[(2-methyl-[1]benzofuro[3,2-d]pyrimidin-4-yl)sulfanyl]acetamide N-(2,3-dihydro-1,4-benzodioxin-6-yl)-2-[(2-methylbenzofuro[3,2-d]pyrimidin-4-yl)thio]acetamide cid_663539
Type:
Small organic molecule
Emp. Form.:
C21H17N3O4S
Mol. Mass.:
407.442
SMILES:
Cc1nc(SCC(=O)Nc2ccc3OCCOc3c2)c2oc3ccccc3c2n1
: