Target
Lysosomal acid glucosylceramidase
Ligand
BDBM42319
Substrate
Meas. Tech.
Dose response cell-based high throughput screening assay to identify enhancers of beta-glucosidase activity
EC50
>50000±n/a nM
Citation
 PubChem, PC Dose response cell-based high throughput screening assay to identify enhancers of beta-glucosidase activity PubChem Bioassay (2008)[AID] 
Target
Name:
Lysosomal acid glucosylceramidase
Synonyms:
Acid beta-glucosidase Beta-glucocerebrosidase D-glucosyl-N-acylsphingosine glucohydrolase GBA1 GC GLUC Glucosylceramidase (GBA) Glucosylceramidase precursor (Beta-glucocerebrosidase) (Acid beta-glucosidase) (D-glucosyl-N-acylsphingosine glucohydrolase) (Alglucerase) (Imiglucerase) beta-glucocerebrosidase (GCase)
Type:
Enzyme
Mol. Mass.:
59724.64
Organism:
Homo sapiens (Human)
Description:
The beta-Glu activity was measured with commercially available beta-glucocerebrosidase (Ceredase) as the enzyme source.
Residue:
536
  
Inhibitor
Name:
BDBM42319
Synonyms:
MLS000044596 N-[3-[4-(3-chlorophenyl)piperazin-1-yl]propyl]-6,7-dimethoxy-2-methyl-1-oxidanylidene-isoquinoline-4-carboxamide N-[3-[4-(3-chlorophenyl)piperazino]propyl]-1-keto-6,7-dimethoxy-2-methyl-isoquinoline-4-carboxamide SMR000022541 | cid_3236581
Type:
Small organic molecule
Emp. Form.:
C26H31ClN4O4
Mol. Mass.:
499.002
SMILES:
COc1cc2c(cn(C)c(=O)c2cc1OC)C(=O)NCCCN1CCN(CC1)c1cccc(Cl)c1
: