Target
Lysosomal acid glucosylceramidase
Ligand
BDBM42345
Substrate
Meas. Tech.
Dose response cell-based high throughput screening assay to identify enhancers of beta-glucosidase activity
EC50
>50000±n/a nM
Citation
 PubChem, PC Dose response cell-based high throughput screening assay to identify enhancers of beta-glucosidase activity PubChem Bioassay (2008)[AID] 
Target
Name:
Lysosomal acid glucosylceramidase
Synonyms:
Acid beta-glucosidase Beta-glucocerebrosidase D-glucosyl-N-acylsphingosine glucohydrolase GBA1 GC GLUC Glucosylceramidase (GBA) Glucosylceramidase precursor (Beta-glucocerebrosidase) (Acid beta-glucosidase) (D-glucosyl-N-acylsphingosine glucohydrolase) (Alglucerase) (Imiglucerase) beta-glucocerebrosidase (GCase)
Type:
Enzyme
Mol. Mass.:
59724.64
Organism:
Homo sapiens (Human)
Description:
The beta-Glu activity was measured with commercially available beta-glucocerebrosidase (Ceredase) as the enzyme source.
Residue:
536
  
Inhibitor
Name:
BDBM42345
Synonyms:
2-furfuryl-[4-(3-methoxyphenyl)-6-(trifluoromethyl)pyrimidin-2-yl]amine N-(2-furanylmethyl)-4-(3-methoxyphenyl)-6-(trifluoromethyl)-2-pyrimidinamine N-(furan-2-ylmethyl)-4-(3-methoxyphenyl)-6-(trifluoromethyl)pyrimidin-2-amine cid_2989085
Type:
Small organic molecule
Emp. Form.:
C17H14F3N3O2
Mol. Mass.:
349.3072
SMILES:
COc1cccc(c1)-c1cc(nc(NCc2ccco2)n1)C(F)(F)F
: