Target
Lysosomal acid glucosylceramidase
Ligand
BDBM42351
Substrate
Meas. Tech.
Dose response cell-based high throughput screening assay to identify enhancers of beta-glucosidase activity
EC50
>50000±n/a nM
Citation
 PubChem, PC Dose response cell-based high throughput screening assay to identify enhancers of beta-glucosidase activity PubChem Bioassay (2008)[AID] 
Target
Name:
Lysosomal acid glucosylceramidase
Synonyms:
Acid beta-glucosidase Beta-glucocerebrosidase D-glucosyl-N-acylsphingosine glucohydrolase GBA1 GC GLUC Glucosylceramidase (GBA) Glucosylceramidase precursor (Beta-glucocerebrosidase) (Acid beta-glucosidase) (D-glucosyl-N-acylsphingosine glucohydrolase) (Alglucerase) (Imiglucerase) beta-glucocerebrosidase (GCase)
Type:
Enzyme
Mol. Mass.:
59724.64
Organism:
Homo sapiens (Human)
Description:
The beta-Glu activity was measured with commercially available beta-glucocerebrosidase (Ceredase) as the enzyme source.
Residue:
536
  
Inhibitor
Name:
BDBM42351
Synonyms:
(3E)-3-[(4-chloroanilino)methylene]-2-(2-hydroxyethylimino)-9-methyl-pyrido[1,2-a]pyrimidin-4-one (3E)-3-[(4-chloroanilino)methylidene]-2-(2-hydroxyethylimino)-9-methylpyrido[1,2-a]pyrimidin-4-one MLS000087761 cid_5310466
Type:
Small organic molecule
Emp. Form.:
C18H17ClN4O2
Mol. Mass.:
356.806
SMILES:
Cc1cccn2c1nc(NCCO)c(C=Nc1ccc(Cl)cc1)c2=O
: