Target
Lysosomal acid glucosylceramidase
Ligand
BDBM42365
Substrate
Meas. Tech.
Dose response cell-based high throughput screening assay to identify enhancers of beta-glucosidase activity
EC50
>10000±n/a nM
Citation
 PubChem, PC Dose response cell-based high throughput screening assay to identify enhancers of beta-glucosidase activity PubChem Bioassay (2008)[AID] 
Target
Name:
Lysosomal acid glucosylceramidase
Synonyms:
Acid beta-glucosidase Beta-glucocerebrosidase D-glucosyl-N-acylsphingosine glucohydrolase GBA1 GC GLUC Glucosylceramidase (GBA) Glucosylceramidase precursor (Beta-glucocerebrosidase) (Acid beta-glucosidase) (D-glucosyl-N-acylsphingosine glucohydrolase) (Alglucerase) (Imiglucerase) beta-glucocerebrosidase (GCase)
Type:
Enzyme
Mol. Mass.:
59724.64
Organism:
Homo sapiens (Human)
Description:
The beta-Glu activity was measured with commercially available beta-glucocerebrosidase (Ceredase) as the enzyme source.
Residue:
536
  
Inhibitor
Name:
BDBM42365
Synonyms:
4-[butyl(ethyl)sulfamoyl]-N-[5-(methylsulfanylmethyl)-1,3,4-oxadiazol-2-yl]benzamide 4-{[butyl(ethyl)amino]sulfonyl}-N-{5-[(methylthio)methyl]-1,3,4-oxadiazol-2-yl}benzamide SMR000021862 | cid_2155641
Type:
Small organic molecule
Emp. Form.:
C17H24N4O4S2
Mol. Mass.:
412.527
SMILES:
CCCCN(CC)S(=O)(=O)c1ccc(cc1)C(=O)Nc1nnc(CSC)o1
: