Target
Lysosomal acid glucosylceramidase
Ligand
BDBM42373
Substrate
Meas. Tech.
Dose response cell-based high throughput screening assay to identify enhancers of beta-glucosidase activity
EC50
>50000±n/a nM
Citation
 PubChem, PC Dose response cell-based high throughput screening assay to identify enhancers of beta-glucosidase activity PubChem Bioassay (2008)[AID] 
Target
Name:
Lysosomal acid glucosylceramidase
Synonyms:
Acid beta-glucosidase Beta-glucocerebrosidase D-glucosyl-N-acylsphingosine glucohydrolase GBA1 GC GLUC Glucosylceramidase (GBA) Glucosylceramidase precursor (Beta-glucocerebrosidase) (Acid beta-glucosidase) (D-glucosyl-N-acylsphingosine glucohydrolase) (Alglucerase) (Imiglucerase) beta-glucocerebrosidase (GCase)
Type:
Enzyme
Mol. Mass.:
59724.64
Organism:
Homo sapiens (Human)
Description:
The beta-Glu activity was measured with commercially available beta-glucocerebrosidase (Ceredase) as the enzyme source.
Residue:
536
  
Inhibitor
Name:
BDBM42373
Synonyms:
MLS000091923 N-[3-[butyl(ethyl)amino]propyl]-7-methoxy-furo[2,3-b]quinoline-2-carboxamide N-{3-[butyl(ethyl)amino]propyl}-7-methoxyfuro[2,3-b]quinoline-2-carboxamide cid_3245431
Type:
Small organic molecule
Emp. Form.:
C22H29N3O3
Mol. Mass.:
383.484
SMILES:
CCCCN(CC)CCCNC(=O)c1cc2cc3ccc(OC)cc3nc2o1
: