Target
Lysosomal acid glucosylceramidase
Ligand
BDBM42386
Substrate
Meas. Tech.
Dose response cell-based high throughput screening assay to identify enhancers of beta-glucosidase activity
EC50
>50000±n/a nM
Citation
 PubChem, PC Dose response cell-based high throughput screening assay to identify enhancers of beta-glucosidase activity PubChem Bioassay (2008)[AID] 
Target
Name:
Lysosomal acid glucosylceramidase
Synonyms:
Acid beta-glucosidase Beta-glucocerebrosidase D-glucosyl-N-acylsphingosine glucohydrolase GBA1 GC GLUC Glucosylceramidase (GBA) Glucosylceramidase precursor (Beta-glucocerebrosidase) (Acid beta-glucosidase) (D-glucosyl-N-acylsphingosine glucohydrolase) (Alglucerase) (Imiglucerase) beta-glucocerebrosidase (GCase)
Type:
Enzyme
Mol. Mass.:
59724.64
Organism:
Homo sapiens (Human)
Description:
The beta-Glu activity was measured with commercially available beta-glucocerebrosidase (Ceredase) as the enzyme source.
Residue:
536
  
Inhibitor
Name:
BDBM42386
Synonyms:
1-(4-methoxyphenyl)-2-[(5-p-anisyl-1,3,4-oxadiazol-2-yl)thio]ethanone 1-(4-methoxyphenyl)-2-[[5-[(4-methoxyphenyl)methyl]-1,3,4-oxadiazol-2-yl]thio]ethanone MLS000051909 cid_1076534
Type:
Small organic molecule
Emp. Form.:
C19H18N2O4S
Mol. Mass.:
370.422
SMILES:
COc1ccc(Cc2nnc(SCC(=O)c3ccc(OC)cc3)o2)cc1
: