Target
Neuropeptide Y receptor type 1
Ligand
BDBM42454
Substrate
Meas. Tech.
Dose response cell-based screening assay for antagonists of neuropeptide Y receptor Y1 (NPY-Y1)
IC50
>35000±n/a nM
Citation
 PubChem, PC Dose response cell-based screening assay for antagonists of neuropeptide Y receptor Y1 (NPY-Y1) PubChem Bioassay (2008)[AID] 
Target
Name:
Neuropeptide Y receptor type 1
Synonyms:
NPY-Y1 NPY1R NPYR neuropeptide Y receptor Y1
Type:
Enzyme Catalytic Domain
Mol. Mass.:
44399.07
Organism:
Homo sapiens (Human)
Description:
NPY-Y1 NPY1R HUMAN::P25929
Residue:
384
  
Inhibitor
Name:
BDBM42454
Synonyms:
4-(2,4-dichlorophenyl)-3-(2-furanylmethyl)-N-phenyl-2-thiazol-3-iumamine;chloride MLS001004807 [4-(2,4-dichlorophenyl)-3-(2-furfuryl)thiazol-3-ium-2-yl]-phenyl-amine;chloride | cid_16196106
Type:
Small organic molecule
Emp. Form.:
C20H15Cl2N2OS
Mol. Mass.:
402.316
SMILES:
Clc1ccc(-c2cs\c(=[NH+]/c3ccccc3)n2Cc2ccco2)c(Cl)c1
: