Target
Neuropeptide Y receptor type 2
Ligand
BDBM42411
Substrate
Meas. Tech.
Dose response counterscreen assay for neuropeptide Y receptor Y1 (NPY-Y1): Cell-based high throughput assay to measure NPY-Y2 antagonism
IC50
14570±n/a nM
Citation
 PubChem, PC Dose response counterscreen assay for neuropeptide Y receptor Y1 (NPY-Y1): Cell-based high throughput assay to measure NPY-Y2 antagonism PubChem Bioassay (2008)[AID] 
Target
Name:
Neuropeptide Y receptor type 2
Synonyms:
NPY-Y2 NPY2-R NPY2R_HUMAN Y2 receptor | neuropeptide Y receptor Y2
Type:
Enzyme Catalytic Domain
Mol. Mass.:
42734.65
Organism:
Homo sapiens (Human)
Description:
NPY-Y2 NPY2R HUMAN::P49146
Residue:
381
  
Inhibitor
Name:
BDBM42411
Synonyms:
(4-hexyl-1,2,3,5,6,7-hexahydrodicyclopenta[1,2-c:1',2'-g]pyridin-8-ylidene)amine;hydrobromide MLS000080127 cid_6603435
Type:
Small organic molecule
Emp. Form.:
C17H26N2
Mol. Mass.:
258.4017
SMILES:
CCCCCCn1c2CCCc2c(=N)c2CCCc12
: