Target
Neuropeptide Y receptor type 2
Ligand
BDBM42413
Substrate
Meas. Tech.
Dose response counterscreen assay for neuropeptide Y receptor Y1 (NPY-Y1): Cell-based high throughput assay to measure NPY-Y2 antagonism
IC50
>35000±n/a nM
Citation
 PubChem, PC Dose response counterscreen assay for neuropeptide Y receptor Y1 (NPY-Y1): Cell-based high throughput assay to measure NPY-Y2 antagonism PubChem Bioassay (2008)[AID] 
Target
Name:
Neuropeptide Y receptor type 2
Synonyms:
NPY-Y2 NPY2-R NPY2R_HUMAN Y2 receptor | neuropeptide Y receptor Y2
Type:
Enzyme Catalytic Domain
Mol. Mass.:
42734.65
Organism:
Homo sapiens (Human)
Description:
NPY-Y2 NPY2R HUMAN::P49146
Residue:
381
  
Inhibitor
Name:
BDBM42413
Synonyms:
(4E)-3-hydroxy-4-[4-(4-methoxyphenoxy)-1,2-dihydropyrazol-3-ylidene]-1-cyclohexa-2,5-dienone (4E)-3-hydroxy-4-[4-(4-methoxyphenoxy)-3-pyrazolin-3-ylidene]cyclohexa-2,5-dien-1-one MLS000083068 cid_5389842
Type:
Small organic molecule
Emp. Form.:
C16H14N2O4
Mol. Mass.:
298.2934
SMILES:
COc1ccc(Oc2c[nH]nc2-c2ccc(O)cc2O)cc1
: