Target
Neuropeptide Y receptor type 2
Ligand
BDBM42418
Substrate
Meas. Tech.
Dose response counterscreen assay for neuropeptide Y receptor Y1 (NPY-Y1): Cell-based high throughput assay to measure NPY-Y2 antagonism
IC50
>35000±n/a nM
Citation
 PubChem, PC Dose response counterscreen assay for neuropeptide Y receptor Y1 (NPY-Y1): Cell-based high throughput assay to measure NPY-Y2 antagonism PubChem Bioassay (2008)[AID] 
Target
Name:
Neuropeptide Y receptor type 2
Synonyms:
NPY-Y2 NPY2-R NPY2R_HUMAN Y2 receptor | neuropeptide Y receptor Y2
Type:
Enzyme Catalytic Domain
Mol. Mass.:
42734.65
Organism:
Homo sapiens (Human)
Description:
NPY-Y2 NPY2R HUMAN::P49146
Residue:
381
  
Inhibitor
Name:
BDBM42418
Synonyms:
1-(1-tert-butyl-1,2,3,4-tetrazol-5-yl)-N-(furan-2-ylmethyl)-N-(phenylmethyl)-1-[4-(trifluoromethyl)phenyl]methanamine Benzyl-[(1-tert-butyl-1H-tetrazol-5-yl)-(4-trifluoromethyl-phenyl)-methyl]-furan-2-ylmethyl-amine N-benzyl-1-(1-tert-butyltetrazol-5-yl)-N-(furan-2-ylmethyl)-1-[4-(trifluoromethyl)phenyl]methanamine benzyl-[(1-tert-butyltetrazol-5-yl)-[4-(trifluoromethyl)phenyl]methyl]-(2-furfuryl)amine | cid_3229320
Type:
Small organic molecule
Emp. Form.:
C25H26F3N5O
Mol. Mass.:
469.502
SMILES:
CC(C)(C)n1nnnc1C(N(Cc1ccco1)Cc1ccccc1)c1ccc(cc1)C(F)(F)F
: