Target
Neuropeptide Y receptor type 1
Ligand
BDBM42485
Substrate
Meas. Tech.
Dose response counterscreen for neuropeptide Y receptor Y2 (NPY-Y2): Cell-based high throughput assay to measure NPY-Y1 antagonism
IC50
>35000±n/a nM
Citation
 PubChem, PC Dose response counterscreen for neuropeptide Y receptor Y2 (NPY-Y2): Cell-based high throughput assay to measure NPY-Y1 antagonism PubChem Bioassay (2008)[AID] 
Target
Name:
Neuropeptide Y receptor type 1
Synonyms:
NPY-Y1 NPY1R NPYR neuropeptide Y receptor Y1
Type:
Enzyme Catalytic Domain
Mol. Mass.:
44399.07
Organism:
Homo sapiens (Human)
Description:
NPY-Y1 NPY1R HUMAN::P25929
Residue:
384
  
Inhibitor
Name:
BDBM42485
Synonyms:
4-methyl-7-[3-[4-(2-methylphenyl)-1-piperazinyl]propoxy]-1-benzopyran-2-one 4-methyl-7-[3-[4-(o-tolyl)piperazino]propoxy]coumarin MLS000550164 cid_1820316
Type:
Small organic molecule
Emp. Form.:
C24H28N2O3
Mol. Mass.:
392.4907
SMILES:
Cc1ccccc1N1CCN(CCCOc2ccc3c(C)cc(=O)oc3c2)CC1
: