Target
Mitogen-activated protein kinase 10
Ligand
BDBM42612
Substrate
Meas. Tech.
Dose response biochemical screening assay for inhibitors of c-Jun N-Terminal Kinase 3 (JNK3)
IC50
30530±n/a nM
Citation
 PubChem, PC Dose response biochemical screening assay for inhibitors of c-Jun N-Terminal Kinase 3 (JNK3) PubChem Bioassay (2008)[AID] 
Target
Name:
Mitogen-activated protein kinase 10
Synonyms:
JNK3 MAP kinase p49 3F12 MK10_HUMAN Mitogen-activated protein kinase 10 (Stress-activated protein kinase JNK3) (c-Jun N-terminal kinase 3) (MAP kinase p49 3F12) PRKM10 Stress-activated protein kinase JNK3 | c-Jun N-terminal kinase 3 (JNK3)
Type:
Enzyme
Mol. Mass.:
52586.89
Organism:
Homo sapiens (Human)
Description:
Residue:
464
  
Inhibitor
Name:
BDBM42612
Synonyms:
3-methyl-5-sulfanylidene-2H-isothiazole-4-carboxylic acid ethyl ester MLS000071155 cid_657881 | ethyl 3-methyl-5-sulfanylidene-2H-1,2-thiazole-4-carboxylate
Type:
Small organic molecule
Emp. Form.:
C7H9NO2S2
Mol. Mass.:
203.282
SMILES:
CCOC(=O)c1c(C)[nH]sc1=S
: