Target
Mitogen-activated protein kinase 10
Ligand
BDBM42708
Substrate
Meas. Tech.
Dose response biochemical screening assay for inhibitors of c-Jun N-Terminal Kinase 3 (JNK3)
IC50
7969±n/a nM
Citation
 PubChem, PC Dose response biochemical screening assay for inhibitors of c-Jun N-Terminal Kinase 3 (JNK3) PubChem Bioassay (2008)[AID] 
Target
Name:
Mitogen-activated protein kinase 10
Synonyms:
JNK3 MAP kinase p49 3F12 MK10_HUMAN Mitogen-activated protein kinase 10 (Stress-activated protein kinase JNK3) (c-Jun N-terminal kinase 3) (MAP kinase p49 3F12) PRKM10 Stress-activated protein kinase JNK3 | c-Jun N-terminal kinase 3 (JNK3)
Type:
Enzyme
Mol. Mass.:
52586.89
Organism:
Homo sapiens (Human)
Description:
Residue:
464
  
Inhibitor
Name:
BDBM42708
Synonyms:
3-[4-(4-phenylpiperazine-1-carbonyl)benzyl]-1H-quinazoline-2,4-quinone 3-[[4-(4-phenylpiperazine-1-carbonyl)phenyl]methyl]-1H-quinazoline-2,4-dione 3-{4-[(4-phenylpiperazin-1-yl)carbonyl]benzyl}quinazoline-2,4(1H,3H)-dione SMR000030202 | cid_3238372
Type:
Small organic molecule
Emp. Form.:
C26H24N4O3
Mol. Mass.:
440.4938
SMILES:
O=C(N1CCN(CC1)c1ccccc1)c1ccc(Cn2c(=O)[nH]c3ccccc3c2=O)cc1
: