Target
Mitogen-activated protein kinase 10
Ligand
BDBM42712
Substrate
Meas. Tech.
Dose response biochemical screening assay for inhibitors of c-Jun N-Terminal Kinase 3 (JNK3)
IC50
4189±n/a nM
Citation
 PubChem, PC Dose response biochemical screening assay for inhibitors of c-Jun N-Terminal Kinase 3 (JNK3) PubChem Bioassay (2008)[AID] 
Target
Name:
Mitogen-activated protein kinase 10
Synonyms:
JNK3 MAP kinase p49 3F12 MK10_HUMAN Mitogen-activated protein kinase 10 (Stress-activated protein kinase JNK3) (c-Jun N-terminal kinase 3) (MAP kinase p49 3F12) PRKM10 Stress-activated protein kinase JNK3 | c-Jun N-terminal kinase 3 (JNK3)
Type:
Enzyme
Mol. Mass.:
52586.89
Organism:
Homo sapiens (Human)
Description:
Residue:
464
  
Inhibitor
Name:
BDBM42712
Synonyms:
3-(2,3-dimethoxyphenyl)-N-(3,4,5-trimethoxyphenyl)-2-isoxazoline-5-carboxamide 3-(2,3-dimethoxyphenyl)-N-(3,4,5-trimethoxyphenyl)-4,5-dihydroisoxazole-5-carboxamide SMR000028391 | cid_3239708
Type:
Small organic molecule
Emp. Form.:
C21H24N2O7
Mol. Mass.:
416.4245
SMILES:
COc1cccc(C2=NOC(C2)C(=O)Nc2cc(OC)c(OC)c(OC)c2)c1OC
: