Target
Nuclear receptor coactivator 1
Ligand
BDBM42931
Substrate
Meas. Tech.
Dose response biochemical High Throughput Screening assay for agonists of the steroid receptor coactivator 1 (SRC-1) recruitment by the peroxisome proliferator-activated receptor gamma (PPARgamma)
EC50
13420±n/a nM
Citation
 PubChem, PC Dose response biochemical High Throughput Screening assay for agonists of the steroid receptor coactivator 1 (SRC-1) recruitment by the peroxisome proliferator-activated receptor gamma (PPARgamma) PubChem Bioassay (2008)[AID] 
Target
Name:
Nuclear receptor coactivator 1
Synonyms:
BHLHE74 NCOA1 NCoA-1 Protein Hin-2 Renal carcinoma antigen NY-REN-52 SRC1 nuclear receptor coactivator 1 isoform 1
Type:
PROTEIN
Mol. Mass.:
156749.34
Organism:
Homo sapiens (Human)
Description:
ChEMBL_759690
Residue:
1441
  
Inhibitor
Name:
BDBM42931
Synonyms:
2-[4-(1,3-benzothiazol-2-yl)-1-piperazinyl]-4-methoxy-1,3-benzothiazole 2-[4-(1,3-benzothiazol-2-yl)piperazino]-4-methoxy-1,3-benzothiazole SMR000027238 | cid_3240147
Type:
Small organic molecule
Emp. Form.:
C19H18N4OS2
Mol. Mass.:
382.502
SMILES:
COc1cccc2sc(nc12)N1CCN(CC1)c1nc2ccccc2s1
: