Target
Nuclear receptor coactivator 1
Ligand
BDBM43018
Substrate
Meas. Tech.
Dose response biochemical High Throughput Screening assay for agonists of the steroid receptor coactivator 1 (SRC-1) recruitment by the peroxisome proliferator-activated receptor gamma (PPARgamma)
EC50
8959±n/a nM
Citation
 PubChem, PC Dose response biochemical High Throughput Screening assay for agonists of the steroid receptor coactivator 1 (SRC-1) recruitment by the peroxisome proliferator-activated receptor gamma (PPARgamma) PubChem Bioassay (2008)[AID] 
Target
Name:
Nuclear receptor coactivator 1
Synonyms:
BHLHE74 NCOA1 NCoA-1 Protein Hin-2 Renal carcinoma antigen NY-REN-52 SRC1 nuclear receptor coactivator 1 isoform 1
Type:
PROTEIN
Mol. Mass.:
156749.34
Organism:
Homo sapiens (Human)
Description:
ChEMBL_759690
Residue:
1441
  
Inhibitor
Name:
BDBM43018
Synonyms:
4-bromanyl-N-(1-propylbenzimidazol-2-yl)benzamide 4-bromo-N-(1-propylbenzimidazol-2-yl)benzamide SMR000152119 | cid_5233279
Type:
Small organic molecule
Emp. Form.:
C17H16BrN3O
Mol. Mass.:
358.232
SMILES:
CCCn1c(NC(=O)c2ccc(Br)cc2)nc2ccccc12
: