Target
Nuclear receptor coactivator 1
Ligand
BDBM43197
Substrate
Meas. Tech.
Dose response biochemical High Throughput Screening assay for agonists of the steroid receptor coactivator 1 (SRC-1) recruitment by the peroxisome proliferator-activated receptor gamma (PPARgamma)
EC50
>79370±n/a nM
Citation
 PubChem, PC Dose response biochemical High Throughput Screening assay for agonists of the steroid receptor coactivator 1 (SRC-1) recruitment by the peroxisome proliferator-activated receptor gamma (PPARgamma) PubChem Bioassay (2008)[AID] 
Target
Name:
Nuclear receptor coactivator 1
Synonyms:
BHLHE74 NCOA1 NCoA-1 Protein Hin-2 Renal carcinoma antigen NY-REN-52 SRC1 nuclear receptor coactivator 1 isoform 1
Type:
PROTEIN
Mol. Mass.:
156749.34
Organism:
Homo sapiens (Human)
Description:
ChEMBL_759690
Residue:
1441
  
Inhibitor
Name:
BDBM43197
Synonyms:
MLS000772150 N-carbamoyl-2-(7-methoxy-4-phenylquinolin-2-yl)sulfanylacetamide N-carbamoyl-2-[(7-methoxy-4-phenyl-2-quinolyl)thio]acetamide cid_2588947
Type:
Small organic molecule
Emp. Form.:
C19H17N3O3S
Mol. Mass.:
367.422
SMILES:
COc1ccc2c(cc(SCC(=O)NC(N)=O)nc2c1)-c1ccccc1
: