Target
Apoptosis regulator Bcl-2
Ligand
BDBM40705
Substrate
Meas. Tech.
Multiplexed high-throughput screen for small molecule regulators of Bcl-2 family protein interactions, specifically Bim-Bcl-2
EC50
46280±n/a nM
Citation
 PubChem, PC Multiplexed high-throughput screen for small molecule regulators of Bcl-2 family protein interactions, specifically Bim-Bcl-2 PubChem Bioassay (2008)[AID] 
Target
Name:
Apoptosis regulator Bcl-2
Synonyms:
Apoptosis regulator Bcl-2 Protein BCL-2 BCL2_HUMAN | Bcl-2 Protein
Type:
Homodimer or heterodimer
Mol. Mass.:
26269.11
Organism:
Homo sapiens (Human)
Description:
P10415
Residue:
239
  
Inhibitor
Name:
BDBM40705
Synonyms:
4-(1,2,5-trimethyl-3-pyrrolyl)-2-thiazolamine MLS000566785 [4-(1,2,5-trimethylpyrrol-3-yl)thiazol-2-yl]amine | cid_2566124
Type:
Small organic molecule
Emp. Form.:
C10H13N3S
Mol. Mass.:
207.295
SMILES:
Cc1cc(-c2csc(N)n2)c(C)n1C
: