Target
Apoptosis regulator Bcl-2
Ligand
BDBM32288
Substrate
Meas. Tech.
Multiplexed high-throughput screen for small molecule regulators of Bcl-2 family protein interactions, specifically Bim-Bcl-2
EC50
2440±n/a nM
Citation
 PubChem, PC Multiplexed high-throughput screen for small molecule regulators of Bcl-2 family protein interactions, specifically Bim-Bcl-2 PubChem Bioassay (2008)[AID] 
Target
Name:
Apoptosis regulator Bcl-2
Synonyms:
Apoptosis regulator Bcl-2 Protein BCL-2 BCL2_HUMAN | Bcl-2 Protein
Type:
Homodimer or heterodimer
Mol. Mass.:
26269.11
Organism:
Homo sapiens (Human)
Description:
P10415
Residue:
239
  
Inhibitor
Name:
BDBM32288
Synonyms:
(1,1-diketo-1,2-benzothiazol-3-yl)-methyl-(4-pyridylmethyleneamino)amine N-methyl-1,1-bis(oxidanylidene)-N-(pyridin-4-ylmethylideneamino)-1,2-benzothiazol-3-amine SMR000162295 isonicotinaldehyde (1,1-dioxido-1,2-benzisothiazol-3-yl)(methyl)hydrazone
Type:
Small organic molecule
Emp. Form.:
C14H12N4O2S
Mol. Mass.:
300.336
SMILES:
CN(N=Cc1ccncc1)C1=NS(=O)(=O)c2ccccc12
: