Target
Apoptosis regulator Bcl-2
Ligand
BDBM33134
Substrate
Meas. Tech.
Multiplexed high-throughput screen for small molecule regulators of Bcl-2 family protein interactions, specifically Bim-Bcl-2
EC50
13750±n/a nM
Citation
 PubChem, PC Multiplexed high-throughput screen for small molecule regulators of Bcl-2 family protein interactions, specifically Bim-Bcl-2 PubChem Bioassay (2008)[AID] 
Target
Name:
Apoptosis regulator Bcl-2
Synonyms:
Apoptosis regulator Bcl-2 Protein BCL-2 BCL2_HUMAN | Bcl-2 Protein
Type:
Homodimer or heterodimer
Mol. Mass.:
26269.11
Organism:
Homo sapiens (Human)
Description:
P10415
Residue:
239
  
Inhibitor
Name:
BDBM33134
Synonyms:
4-(2,3-diphenyl-1,2,4-thiadiazol-5-ylidene)morpholin-4-ium;perchlorate MLS000702136 cid_15945006
Type:
Small organic molecule
Emp. Form.:
C18H18N3OS
Mol. Mass.:
324.419
SMILES:
C1CN(CCO1)c1nc(-c2ccccc2)n([s+]1)-c1ccccc1
: