Target
Apoptosis regulator Bcl-2
Ligand
BDBM33171
Substrate
Meas. Tech.
Multiplexed high-throughput screen for small molecule regulators of Bcl-2 family protein interactions, specifically Bim-Bcl-2
EC50
9270±n/a nM
Citation
 PubChem, PC Multiplexed high-throughput screen for small molecule regulators of Bcl-2 family protein interactions, specifically Bim-Bcl-2 PubChem Bioassay (2008)[AID] 
Target
Name:
Apoptosis regulator Bcl-2
Synonyms:
Apoptosis regulator Bcl-2 Protein BCL-2 BCL2_HUMAN | Bcl-2 Protein
Type:
Homodimer or heterodimer
Mol. Mass.:
26269.11
Organism:
Homo sapiens (Human)
Description:
P10415
Residue:
239
  
Inhibitor
Name:
BDBM33171
Synonyms:
2-(4-fluorophenyl)-1H-perimidine SMR000284056 | cid_802809
Type:
Small organic molecule
Emp. Form.:
C17H11FN2
Mol. Mass.:
262.281
SMILES:
Fc1ccc(cc1)-c1nc2cccc3cccc([nH]1)c23
: