Target
Induced myeloid leukemia cell differentiation protein Mcl-1
Ligand
BDBM32265
Substrate
Meas. Tech.
Multiplexed dose response screen for small molecule regulators of Bcl-2 family protein interactions, specifically Bim-Mcl-1.
EC50
2540±n/a nM
Citation
 PubChem, PC Multiplexed dose response screen for small molecule regulators of Bcl-2 family protein interactions, specifically Bim-Mcl-1. PubChem Bioassay (2008)[AID] 
Target
Name:
Induced myeloid leukemia cell differentiation protein Mcl-1
Synonyms:
BCL2L3 Bcl-2-like protein 3 (Mcl-1) Bcl2-L-3 MCL1 Mcl-1 Myeloid cell leukemia sequence 1 (BCL2-related) | mcl1/EAT
Type:
Membrane; Single-pass membrane protein
Mol. Mass.:
37332.87
Organism:
Homo sapiens (Human)
Description:
Q07820
Residue:
350
  
Inhibitor
Name:
BDBM32265
Synonyms:
4-(3-ethoxypropylamino)-6,7-dimethoxy-1H-quinazoline-2-thione MLS000045007 cid_3237310
Type:
Small organic molecule
Emp. Form.:
C15H21N3O3S
Mol. Mass.:
323.411
SMILES:
CCOCCCNc1[nH]c(=S)nc2cc(OC)c(OC)cc12
: