Target
Induced myeloid leukemia cell differentiation protein Mcl-1
Ligand
BDBM33123
Substrate
Meas. Tech.
Multiplexed dose response screen for small molecule regulators of Bcl-2 family protein interactions, specifically Bim-Mcl-1.
EC50
7780±n/a nM
Citation
 PubChem, PC Multiplexed dose response screen for small molecule regulators of Bcl-2 family protein interactions, specifically Bim-Mcl-1. PubChem Bioassay (2008)[AID] 
Target
Name:
Induced myeloid leukemia cell differentiation protein Mcl-1
Synonyms:
BCL2L3 Bcl-2-like protein 3 (Mcl-1) Bcl2-L-3 MCL1 Mcl-1 Myeloid cell leukemia sequence 1 (BCL2-related) | mcl1/EAT
Type:
Membrane; Single-pass membrane protein
Mol. Mass.:
37332.87
Organism:
Homo sapiens (Human)
Description:
Q07820
Residue:
350
  
Inhibitor
Name:
BDBM33123
Synonyms:
MLS000587395 N-[(5-bromanyl-2-phenylmethoxy-phenyl)methylideneamino]-2-[2-(3-methylphenoxy)ethanoylamino]ethanamide N-[(5-bromo-2-phenylmethoxyphenyl)methylideneamino]-2-[[2-(3-methylphenoxy)acetyl]amino]acetamide SMR000211373 | cid_1908777
Type:
Small organic molecule
Emp. Form.:
C25H24BrN3O4
Mol. Mass.:
510.38
SMILES:
Cc1cccc(OCC(=O)NCC(=O)NN=Cc2cc(Br)ccc2OCc2ccccc2)c1
: