Target
Cell division control protein 42 homolog
Ligand
BDBM43221
Substrate
Meas. Tech.
Multiplex dose response to identify specific small molecule inhibitors of Ras and Ras-related GTPases specifically Cdc42 activated mutant
EC50
91.98±n/a nM
Citation
 PubChem, PC Multiplex dose response to identify specific small molecule inhibitors of Ras and Ras-related GTPases specifically Cdc42 activated mutant PubChem Bioassay (2010)[AID] 
Target
Name:
Cell division control protein 42 homolog
Synonyms:
CDC42 Cell division control protein 42 homolog cell division cycle 42 (GTP binding protein, 25kDa)
Type:
PROTEIN
Mol. Mass.:
21258.36
Organism:
Homo sapiens (Human)
Description:
ChEMBL_652970
Residue:
191
  
Inhibitor
Name:
BDBM43221
Synonyms:
2-(benzoylcarbamothioylamino)-5,5-dimethyl-4,7-dihydrothieno[2,3-c]pyran-3-carboxylic acid 2-[[benzamido(sulfanylidene)methyl]amino]-5,5-dimethyl-4,7-dihydrothieno[2,3-c]pyran-3-carboxylic acid 5,5-dimethyl-2-(phenylcarbonylcarbamothioylamino)-4,7-dihydrothieno[2,3-c]pyran-3-carboxylic acid SMR000297947 | cid_1067700
Type:
Small organic molecule
Emp. Form.:
C18H18N2O4S2
Mol. Mass.:
390.477
SMILES:
CC1(C)Cc2c(CO1)sc(NC(=S)NC(=O)c1ccccc1)c2C(O)=O
: