Target
Cell division control protein 42 homolog
Ligand
BDBM43230
Substrate
Meas. Tech.
Multiplex dose response to identify specific small molecule inhibitors of Ras and Ras-related GTPases specifically Cdc42 activated mutant
EC50
1837±n/a nM
Citation
 PubChem, PC Multiplex dose response to identify specific small molecule inhibitors of Ras and Ras-related GTPases specifically Cdc42 activated mutant PubChem Bioassay (2010)[AID] 
Target
Name:
Cell division control protein 42 homolog
Synonyms:
CDC42 Cell division control protein 42 homolog cell division cycle 42 (GTP binding protein, 25kDa)
Type:
PROTEIN
Mol. Mass.:
21258.36
Organism:
Homo sapiens (Human)
Description:
ChEMBL_652970
Residue:
191
  
Inhibitor
Name:
BDBM43230
Synonyms:
2-(7,8-dihydro-6H-cyclopenta[2,3]thieno[2,4-d]pyrimidin-1-ylsulfanyl)benzoic acid MLS000774547 cid_2415319
Type:
Small organic molecule
Emp. Form.:
C16H12N2O2S2
Mol. Mass.:
328.409
SMILES:
OC(=O)c1ccccc1Sc1ncnc2sc3CCCc3c12
: